{"text_format":"1","workbook":"xlsx","n_sheets":2,"sheets":["出品一覧表","出品票"],"not_rendered":{"charts":0,"images":0,"macros":1,"external_links":0,"defined_names":6,"comments":0,"pivot_tables":0},"unopened":[],"bounds":{"document_bytes":16777216,"sheet_cells":100000,"rows_first":2000,"rows_last":500,"rows_between":2000,"halvings":0,"cell_chars":16384,"cell_head_chars":4096},"cells_cut":0,"cells_raw":0,"read":"whole","date_system":"1900"}

{"sheet":"出品一覧表","index":0,"n_rows":152,"n_cols":83,"rows_kept":152,"cut":false,"hidden":false,"merged":[[3,1,3,9],[2,1,2,9],[0,1,1,9],[9,1,9,2],[10,1,10,2],[4,2,4,8],[10,3,10,9],[9,3,9,9],[6,1,7,9],[5,1,5,9],[21,2,21,4],[14,1,14,2],[16,1,16,2],[18,1,18,2],[17,1,17,2],[15,1,15,2],[18,3,18,9],[17,3,17,9],[16,3,16,9],[15,3,15,9],[13,3,13,9],[14,3,14,9],[12,3,12,9],[11,3,11,9],[13,1,13,2],[12,1,12,2],[11,1,11,2]]}
[null,"第３回　兵庫書写・書道コンクール　出品一覧表"]
[]
[null,"※作品の提出時に紙ベースの一覧表を一枚ご提出ください。"]
[null,"※データはエクセルにて下記のメールアドレスにご提出ください。"]
[null,null," hyogo.ss.con@gmail.com"]
[null,"※パスワードが必要な学校は別のメールでパスワードのみ送付ください。"]
[null,"第３回　兵庫書写・書道コンクール　出品一覧表"]
[]
[null,"◆以下の太枠内に必要事項をご記載下さい（日中連絡が取ることが出来るものを記載下さい）。"]
[null,"ふりがな"]
[null,"所属学校名"]
[null,"ふりがな"]
[null,"ご担当者"]
[null,"〒"]
[null,"住所"]
[null,"電話番号"]
[null,"ＦＡＸ"]
[null,"ＥｰＭＡＩＬ"]
[null,"出品総数",null,{"$f":"IF(COUNTA(H23:H152)=0,\"\",COUNTA(H23:H152))","v":""}]
[null,"◆出品者リスト(所属学校名、学年、名前を記入てください) ※出品票と連動します"]
[null,null," ※第二水準以外の漢字は備考に説明を入力してください。"]
[null,"番号","校種・学年",null,null,"校種・学年","学校名","名前","ふりがな","備考"]
[null,1,null,null,null,{"$f":"CONCATENATE(C23,\" \",D23,\" \",E23)","v":"  "},{"$f":"IF(H23=\"\",\"\",$D$11)","v":""}]
[null,2,null,null,null,{"$f":"CONCATENATE(C24,\" \",D24,\" \",E24)","v":"  "},{"$f":"IF(H24=\"\",\"\",$D$11)","v":""}]
[null,3,null,null,null,"  ",""]
[null,4,null,null,null,"  ","",null,null,null,null,null,null,null,null,null,null,null,null,null,null,null,null,null,null,null,null,null,null,null,null,null,null,null,null,null,null,null,null,null,null,null,null,null,null,null,null,null,null,null,null,null,null,null,null,null,null,null,null,null,null,null,null,null,null,null,null,null,null,null,null,null,null,null,null,null,null,null,null,null,"大",1,"年"]
[null,5,null,null,null,"  ","",null,null,null,null,null,null,null,null,null,null,null,null,null,null,null,null,null,null,null,null,null,null,null,null,null,null,null,null,null,null,null,null,null,null,null,null,null,null,null,null,null,null,null,null,null,null,null,null,null,null,null,null,null,null,null,null,null,null,null,null,null,null,null,null,null,null,null,null,null,null,null,null,null,"高",2,"年次"]
[null,6,null,null,null,"  ","",null,null,null,null,null,null,null,null,null,null,null,null,null,null,null,null,null,null,null,null,null,null,null,null,null,null,null,null,null,null,null,null,null,null,null,null,null,null,null,null,null,null,null,null,null,null,null,null,null,null,null,null,null,null,null,null,null,null,null,null,null,null,null,null,null,null,null,null,null,null,null,null,null,"中",3]
[null,7,null,null,null,"  ","",null,null,null,null,null,null,null,null,null,null,null,null,null,null,null,null,null,null,null,null,null,null,null,null,null,null,null,null,null,null,null,null,null,null,null,null,null,null,null,null,null,null,null,null,null,null,null,null,null,null,null,null,null,null,null,null,null,null,null,null,null,null,null,null,null,null,null,null,null,null,null,null,null,"小",4]
[null,8,null,null,null,"  ","",null,null,null,null,null,null,null,null,null,null,null,null,null,null,null,null,null,null,null,null,null,null,null,null,null,null,null,null,null,null,null,null,null,null,null,null,null,null,null,null,null,null,null,null,null,null,null,null,null,null,null,null,null,null,null,null,null,null,null,null,null,null,null,null,null,null,null,null,null,null,null,null,null,null,5]
[null,9,null,null,null,"  ","",null,null,null,null,null,null,null,null,null,null,null,null,null,null,null,null,null,null,null,null,null,null,null,null,null,null,null,null,null,null,null,null,null,null,null,null,null,null,null,null,null,null,null,null,null,null,null,null,null,null,null,null,null,null,null,null,null,null,null,null,null,null,null,null,null,null,null,null,null,null,null,null,null,null,6]
[null,10,null,null,null,"  ","",null,null,null,null,null,null,null,null,null,null,null,null,null,null,null,null,null,null,null,null,null,null,null,null,null,null,null,null,null,null,null,null,null,null,null,null,null,null,null,null,null,null,null,null,null,null,null,null,null,null,null,null,null,null,null,null,null,null,null,null,null,null,null,null,null,null,null,null,null,null,null,null,null,null,7]
[null,11,null,null,null,"  ","",null,null,null,null,null,null,null,null,null,null,null,null,null,null,null,null,null,null,null,null,null,null,null,null,null,null,null,null,null,null,null,null,null,null,null,null,null,null,null,null,null,null,null,null,null,null,null,null,null,null,null,null,null,null,null,null,null,null,null,null,null,null,null,null,null,null,null,null,null,null,null,null,null,null,8]
[null,12,null,null,null,"  ","",null,null,null,null,null,null,null,null,null,null,null,null,null,null,null,null,null,null,null,null,null,null,null,null,null,null,null,null,null,null,null,null,null,null,null,null,null,null,null,null,null,null,null,null,null,null,null,null,null,null,null,null,null,null,null,null,null,null,null,null,null,null,null,null,null,null,null,null,null,null,null,null,null,null,9]
[null,13,null,null,null,"  ",""]
[null,14,null,null,null,"  ",""]
[null,15,null,null,null,"  ",""]
[null,16,null,null,null,"  ",""]
[null,17,null,null,null,"  ",""]
[null,18,null,null,null,"  ",""]
[null,19,null,null,null,"  ",""]
[null,20,null,null,null,"  ",""]
[null,21,null,null,null,"  ",""]
[null,22,null,null,null,"  ",""]
[null,23,null,null,null,"  ",""]
[null,24,null,null,null,"  ",""]
[null,25,null,null,null,"  ",""]
[null,26,null,null,null,"  ",""]
[null,27,null,null,null,"  ",""]
[null,28,null,null,null,"  ",""]
[null,29,null,null,null,"  ",""]
[null,30,null,null,null,"  ",""]
[null,31,null,null,null,"  ",""]
[null,32,null,null,null,"  ",""]
[null,33,null,null,null,"  ",""]
[null,34,null,null,null,"  ",""]
[null,35,null,null,null,"  ",""]
[null,36,null,null,null,"  ",""]
[null,37,null,null,null,"  ",""]
[null,38,null,null,null,"  ",""]
{"$rows_left_out":93}
{"sheet":"出品票","index":1,"n_rows":885,"n_cols":8,"rows_kept":885,"cut":false,"hidden":false,"merged":[[770,2,770,3],[770,6,770,7],[771,2,771,3],[771,6,771,7],[772,1,773,1],[772,5,773,5],[773,2,773,3],[773,6,773,7],[774,2,774,3],[774,6,774,7],[765,1,765,3],[765,5,765,7],[766,2,766,3],[766,6,766,7],[767,2,767,3],[767,6,767,7],[768,2,768,3],[768,6,768,7],[769,2,769,3],[769,6,769,7],[759,2,759,3],[759,6,759,7],[760,2,760,3],[760,6,760,7],[761,1,762,1],[761,5,762,5],[762,2,762,3],[762,6,762,7],[763,2,763,3],[763,6,763,7],[754,1,754,3],[754,5,754,7],[755,2,755,3],[755,6,755,7],[756,2,756,3],[756,6,756,7],[757,2,757,3],[757,6,757,7],[758,2,758,3],[758,6,758,7],[748,2,748,3],[748,6,748,7],[749,2,749,3],[749,6,749,7],[750,1,751,1],[750,5,751,5],[751,2,751,3],[751,6,751,7],[752,2,752,3],[752,6,752,7],[743,1,743,3],[743,5,743,7],[744,2,744,3],[744,6,744,7],[745,2,745,3],[745,6,745,7],[746,2,746,3],[746,6,746,7],[747,2,747,3],[747,6,747,7],[737,2,737,3],[737,6,737,7],[738,2,738,3],[738,6,738,7],[739,1,740,1],[739,5,740,5],[740,2,740,3],[740,6,740,7],[741,2,741,3],[741,6,741,7],[732,1,732,3],[732,5,732,7],[733,2,733,3],[733,6,733,7],[734,2,734,3],[734,6,734,7],[735,2,735,3],[735,6,735,7],[736,2,736,3],[736,6,736,7],[726,2,726,3],[726,6,726,7],[727,2,727,3],[727,6,727,7],[728,1,729,1],[728,5,729,5],[729,2,729,3],[729,6,729,7],[730,2,730,3],[730,6,730,7],[721,1,721,3],[721,5,721,7],[722,2,722,3],[722,6,722,7],[723,2,723,3],[723,6,723,7],[724,2,724,3],[724,6,724,7],[725,2,725,3],[725,6,725,7],[715,2,715,3],[715,6,715,7],[716,2,716,3],[716,6,716,7],[717,1,718,1],[717,5,718,5],[718,2,718,3],[718,6,718,7],[719,2,719,3],[719,6,719,7],[710,1,710,3],[710,5,710,7],[711,2,711,3],[711,6,711,7],[712,2,712,3],[712,6,712,7],[713,2,713,3],[713,6,713,7],[714,2,714,3],[714,6,714,7],[704,2,704,3],[704,6,704,7],[705,2,705,3],[705,6,705,7],[706,1,707,1],[706,5,707,5],[707,2,707,3],[707,6,707,7],[708,2,708,3],[708,6,708,7],[699,1,699,3],[699,5,699,7],[700,2,700,3],[700,6,700,7],[701,2,701,3],[701,6,701,7],[702,2,702,3],[702,6,702,7],[703,2,703,3],[703,6,703,7],[693,2,693,3],[693,6,693,7],[694,2,694,3],[694,6,694,7],[695,1,696,1],[695,5,696,5],[696,2,696,3],[696,6,696,7],[697,2,697,3],[697,6,697,7],[688,1,688,3],[688,5,688,7],[689,2,689,3],[689,6,689,7],[690,2,690,3],[690,6,690,7],[691,2,691,3],[691,6,691,7],[692,2,692,3],[692,6,692,7],[682,2,682,3],[682,6,682,7],[683,2,683,3],[683,6,683,7],[684,1,685,1],[684,5,685,5],[685,2,685,3],[685,6,685,7],[686,2,686,3],[686,6,686,7],[677,1,677,3],[677,5,677,7],[678,2,678,3],[678,6,678,7],[679,2,679,3],[679,6,679,7],[680,2,680,3],[680,6,680,7],[681,2,681,3],[681,6,681,7],[671,2,671,3],[671,6,671,7],[672,2,672,3],[672,6,672,7],[673,1,674,1],[673,5,674,5],[674,2,674,3],[674,6,674,7],[675,2,675,3],[675,6,675,7],[666,1,666,3],[666,5,666,7],[667,2,667,3],[667,6,667,7],[668,2,668,3],[668,6,668,7],[669,2,669,3],[669,6,669,7],[670,2,670,3],[670,6,670,7],[660,2,660,3],[660,6,660,7],[661,2,661,3],[661,6,661,7],[662,1,663,1],[662,5,663,5],[663,2,663,3],[663,6,663,7],[664,2,664,3],[664,6,664,7],[655,1,655,3],[655,5,655,7],[656,2,656,3],[656,6,656,7],[657,2,657,3],[657,6,657,7],[658,2,658,3],[658,6,658,7],[659,2,659,3],[659,6,659,7],[649,2,649,3],[649,6,649,7],[650,2,650,3],[650,6,650,7],[651,1,652,1],[651,5,652,5],[652,2,652,3],[652,6,652,7],[653,2,653,3],[653,6,653,7],[644,1,644,3],[644,5,644,7],[645,2,645,3],[645,6,645,7],[646,2,646,3],[646,6,646,7],[647,2,647,3],[647,6,647,7],[648,2,648,3],[648,6,648,7],[638,2,638,3],[638,6,638,7],[639,2,639,3],[639,6,639,7],[640,1,641,1],[640,5,641,5],[641,2,641,3],[641,6,641,7],[642,2,642,3],[642,6,642,7],[633,1,633,3],[633,5,633,7],[634,2,634,3],[634,6,634,7],[635,2,635,3],[635,6,635,7],[636,2,636,3],[636,6,636,7],[637,2,637,3],[637,6,637,7],[627,2,627,3],[627,6,627,7],[628,2,628,3],[628,6,628,7],[629,1,630,1],[629,5,630,5],[630,2,630,3],[630,6,630,7],[631,2,631,3],[631,6,631,7],[622,1,622,3],[622,5,622,7],[623,2,623,3],[623,6,623,7],[624,2,624,3],[624,6,624,7],[625,2,625,3],[625,6,625,7],[626,2,626,3],[626,6,626,7],[616,2,616,3],[616,6,616,7],[617,2,617,3],[617,6,617,7],[618,1,619,1],[618,5,619,5],[619,2,619,3],[619,6,619,7],[620,2,620,3],[620,6,620,7],[611,1,611,3],[611,5,611,7],[612,2,612,3],[612,6,612,7],[613,2,613,3],[613,6,613,7],[614,2,614,3],[614,6,614,7],[615,2,615,3],[615,6,615,7],[605,2,605,3],[605,6,605,7],[606,2,606,3],[606,6,606,7],[607,1,608,1],[607,5,608,5],[608,2,608,3],[608,6,608,7],[609,2,609,3],[609,6,609,7],[600,1,600,3],[600,5,600,7],[601,2,601,3],[601,6,601,7],[602,2,602,3],[602,6,602,7],[603,2,603,3],[603,6,603,7],[604,2,604,3],[604,6,604,7],[594,2,594,3],[594,6,594,7],[595,2,595,3],[595,6,595,7],[596,1,597,1],[596,5,597,5],[597,2,597,3],[597,6,597,7],[598,2,598,3],[598,6,598,7],[589,1,589,3],[589,5,589,7],[590,2,590,3],[590,6,590,7],[591,2,591,3],[591,6,591,7],[592,2,592,3],[592,6,592,7],[593,2,593,3],[593,6,593,7],[583,2,583,3],[583,6,583,7],[584,2,584,3],[584,6,584,7],[585,1,586,1],[585,5,586,5],[586,2,586,3],[586,6,586,7],[587,2,587,3],[587,6,587,7],[578,1,578,3],[578,5,578,7],[579,2,579,3],[579,6,579,7],[580,2,580,3],[580,6,580,7],[581,2,581,3],[581,6,581,7],[582,2,582,3],[582,6,582,7],[572,2,572,3],[572,6,572,7],[573,2,573,3],[573,6,573,7],[574,1,575,1],[574,5,575,5],[575,2,575,3],[575,6,575,7],[576,2,576,3],[576,6,576,7],[567,1,567,3],[567,5,567,7],[568,2,568,3],[568,6,568,7],[569,2,569,3],[569,6,569,7],[570,2,570,3],[570,6,570,7],[571,2,571,3],[571,6,571,7],[561,2,561,3],[561,6,561,7],[562,2,562,3],[562,6,562,7],[563,1,564,1],[563,5,564,5],[564,2,564,3],[564,6,564,7],[565,2,565,3],[565,6,565,7],[556,1,556,3],[556,5,556,7],[557,2,557,3],[557,6,557,7],[558,2,558,3],[558,6,558,7],[559,2,559,3],[559,6,559,7],[560,2,560,3],[560,6,560,7],[554,2,554,3],[554,6,554,7],[550,2,550,3],[550,6,550,7],[551,2,551,3],[551,6,551,7],[552,1,553,1],[552,5,553,5],[553,2,553,3],[553,6,553,7],[547,2,547,3],[547,6,547,7],[548,2,548,3],[548,6,548,7],[549,2,549,3],[549,6,549,7],[543,2,543,3],[543,6,543,7],[545,1,545,3],[545,5,545,7],[546,2,546,3],[546,6,546,7],[539,2,539,3],[539,6,539,7],[540,2,540,3],[540,6,540,7],[541,1,542,1],[541,5,542,5],[542,2,542,3],[542,6,542,7],[536,2,536,3],[536,6,536,7],[537,2,537,3],[537,6,537,7],[538,2,538,3],[538,6,538,7],[532,2,532,3],[532,6,532,7],[534,1,534,3],[534,5,534,7],[535,2,535,3],[535,6,535,7],[528,2,528,3],[528,6,528,7],[529,2,529,3],[529,6,529,7],[530,1,531,1],[530,5,531,5],[531,2,531,3],[531,6,531,7],[525,2,525,3],[525,6,525,7],[526,2,526,3],[526,6,526,7],[527,2,527,3],[527,6,527,7],[521,2,521,3],[521,6,521,7],[523,1,523,3],[523,5,523,7],[524,2,524,3],[524,6,524,7],[517,2,517,3],[517,6,517,7],[518,2,518,3],[518,6,518,7],[519,1,520,1],[519,5,520,5],[520,2,520,3],[520,6,520,7],[514,2,514,3],[514,6,514,7],[515,2,515,3],[515,6,515,7],[516,2,516,3],[516,6,516,7],[510,2,510,3],[510,6,510,7],[512,1,512,3],[512,5,512,7],[513,2,513,3],[513,6,513,7],[506,2,506,3],[506,6,506,7],[507,2,507,3],[507,6,507,7],[508,1,509,1],[508,5,509,5],[509,2,509,3],[509,6,509,7],[503,2,503,3],[503,6,503,7],[504,2,504,3],[504,6,504,7],[505,2,505,3],[505,6,505,7],[499,2,499,3],[499,6,499,7],[501,1,501,3],[501,5,501,7],[502,2,502,3],[502,6,502,7],[495,2,495,3],[495,6,495,7],[496,2,496,3],[496,6,496,7],[497,1,498,1],[497,5,498,5],[498,2,498,3],[498,6,498,7],[492,2,492,3],[492,6,492,7],[493,2,493,3],[493,6,493,7],[494,2,494,3],[494,6,494,7],[488,2,488,3],[488,6,488,7],[490,1,490,3],[490,5,490,7],[491,2,491,3],[491,6,491,7],[484,2,484,3],[484,6,484,7],[485,2,485,3],[485,6,485,7],[486,1,487,1],[486,5,487,5],[487,2,487,3],[487,6,487,7],[481,2,481,3],[481,6,481,7],[482,2,482,3],[482,6,482,7],[483,2,483,3],[483,6,483,7],[477,2,477,3],[477,6,477,7],[479,1,479,3],[479,5,479,7],[480,2,480,3],[480,6,480,7],[473,2,473,3],[473,6,473,7],[474,2,474,3],[474,6,474,7],[475,1,476,1],[475,5,476,5],[476,2,476,3],[476,6,476,7],[470,2,470,3],[470,6,470,7],[471,2,471,3],[471,6,471,7],[472,2,472,3],[472,6,472,7],[466,2,466,3],[466,6,466,7],[468,1,468,3],[468,5,468,7],[469,2,469,3],[469,6,469,7],[462,2,462,3],[462,6,462,7],[463,2,463,3],[463,6,463,7],[464,1,465,1],[464,5,465,5],[465,2,465,3],[465,6,465,7],[459,2,459,3],[459,6,459,7],[460,2,460,3],[460,6,460,7],[461,2,461,3],[461,6,461,7],[455,2,455,3],[455,6,455,7],[457,1,457,3],[457,5,457,7],[458,2,458,3],[458,6,458,7],[451,2,451,3],[451,6,451,7],[452,2,452,3],[452,6,452,7],[453,1,454,1],[453,5,454,5],[454,2,454,3],[454,6,454,7],[448,2,448,3],[448,6,448,7],[449,2,449,3],[449,6,449,7],[450,2,450,3],[450,6,450,7],[444,2,444,3],[444,6,444,7],[446,1,446,3],[446,5,446,7],[447,2,447,3],[447,6,447,7],[440,2,440,3],[440,6,440,7],[441,2,441,3],[441,6,441,7],[442,1,443,1],[442,5,443,5],[443,2,443,3],[443,6,443,7],[437,2,437,3],[437,6,437,7],[438,2,438,3],[438,6,438,7],[439,2,439,3],[439,6,439,7],[433,2,433,3],[433,6,433,7],[435,1,435,3],[435,5,435,7],[436,2,436,3],[436,6,436,7],[429,2,429,3],[429,6,429,7],[430,2,430,3],[430,6,430,7],[431,1,432,1],[431,5,432,5],[432,2,432,3],[432,6,432,7],[426,2,426,3],[426,6,426,7],[427,2,427,3],[427,6,427,7],[428,2,428,3],[428,6,428,7],[422,2,422,3],[422,6,422,7],[424,1,424,3],[424,5,424,7],[425,2,425,3],[425,6,425,7],[418,2,418,3],[418,6,418,7],[419,2,419,3],[419,6,419,7],[420,1,421,1],[420,5,421,5],[421,2,421,3],[421,6,421,7],[415,2,415,3],[415,6,415,7],[416,2,416,3],[416,6,416,7],[417,2,417,3],[417,6,417,7],[411,2,411,3],[411,6,411,7],[413,1,413,3],[413,5,413,7],[414,2,414,3],[414,6,414,7],[407,2,407,3],[407,6,407,7],[408,2,408,3],[408,6,408,7],[409,1,410,1],[409,5,410,5],[410,2,410,3],[410,6,410,7],[404,2,404,3],[404,6,404,7],[405,2,405,3],[405,6,405,7],[406,2,406,3],[406,6,406,7],[400,2,400,3],[400,6,400,7],[402,1,402,3],[402,5,402,7],[403,2,403,3],[403,6,403,7],[396,2,396,3],[396,6,396,7],[397,2,397,3],[397,6,397,7],[398,1,399,1],[398,5,399,5],[399,2,399,3],[399,6,399,7],[393,2,393,3],[393,6,393,7],[394,2,394,3],[394,6,394,7],[395,2,395,3],[395,6,395,7],[389,2,389,3],[389,6,389,7],[391,1,391,3],[391,5,391,7],[392,2,392,3],[392,6,392,7],[385,2,385,3],[385,6,385,7],[386,2,386,3],[386,6,386,7],[387,1,388,1],[387,5,388,5],[388,2,388,3],[388,6,388,7],[382,2,382,3],[382,6,382,7],[383,2,383,3],[383,6,383,7],[384,2,384,3],[384,6,384,7],[378,2,378,3],[378,6,378,7],[380,1,380,3],[380,5,380,7],[381,2,381,3],[381,6,381,7],[374,2,374,3],[374,6,374,7],[375,2,375,3],[375,6,375,7],[376,1,377,1],[376,5,377,5],[377,2,377,3],[377,6,377,7],[371,2,371,3],[371,6,371,7],[372,2,372,3],[372,6,372,7],[373,2,373,3],[373,6,373,7],[367,2,367,3],[367,6,367,7],[369,1,369,3],[369,5,369,7],[370,2,370,3],[370,6,370,7],[363,2,363,3],[363,6,363,7],[364,2,364,3],[364,6,364,7],[365,1,366,1],[365,5,366,5],[366,2,366,3],[366,6,366,7],[360,2,360,3],[360,6,360,7],[361,2,361,3],[361,6,361,7],[362,2,362,3],[362,6,362,7],[356,2,356,3],[356,6,356,7],[358,1,358,3],[358,5,358,7],[359,2,359,3],[359,6,359,7],[352,2,352,3],[352,6,352,7],[353,2,353,3],[353,6,353,7],[354,1,355,1],[354,5,355,5],[355,2,355,3],[355,6,355,7],[349,2,349,3],[349,6,349,7],[350,2,350,3],[350,6,350,7],[351,2,351,3],[351,6,351,7],[345,2,345,3],[345,6,345,7],[347,1,347,3],[347,5,347,7],[348,2,348,3],[348,6,348,7],[341,2,341,3],[341,6,341,7],[342,2,342,3],[342,6,342,7],[343,1,344,1],[343,5,344,5],[344,2,344,3],[344,6,344,7],[338,2,338,3],[338,6,338,7],[339,2,339,3],[339,6,339,7],[340,2,340,3],[340,6,340,7],[334,2,334,3],[334,6,334,7],[336,1,336,3],[336,5,336,7],[337,2,337,3],[337,6,337,7],[330,2,330,3],[330,6,330,7],[331,2,331,3],[331,6,331,7],[332,1,333,1],[332,5,333,5],[333,2,333,3],[333,6,333,7],[327,2,327,3],[327,6,327,7],[328,2,328,3],[328,6,328,7],[329,2,329,3],[329,6,329,7],[323,2,323,3],[323,6,323,7],[325,1,325,3],[325,5,325,7],[326,2,326,3],[326,6,326,7],[319,2,319,3],[319,6,319,7],[320,2,320,3],[320,6,320,7],[321,1,322,1],[321,5,322,5],[322,2,322,3],[322,6,322,7],[316,2,316,3],[316,6,316,7],[317,2,317,3],[317,6,317,7],[318,2,318,3],[318,6,318,7],[312,2,312,3],[312,6,312,7],[314,1,314,3],[314,5,314,7],[315,2,315,3],[315,6,315,7],[308,2,308,3],[308,6,308,7],[309,2,309,3],[309,6,309,7],[310,1,311,1],[310,5,311,5],[311,2,311,3],[311,6,311,7],[305,2,305,3],[305,6,305,7],[306,2,306,3],[306,6,306,7],[307,2,307,3],[307,6,307,7],[301,2,301,3],[301,6,301,7],[303,1,303,3],[303,5,303,7],[304,2,304,3],[304,6,304,7],[297,2,297,3],[297,6,297,7],[298,2,298,3],[298,6,298,7],[299,1,300,1],[299,5,300,5],[300,2,300,3],[300,6,300,7],[294,2,294,3],[294,6,294,7],[295,2,295,3],[295,6,295,7],[296,2,296,3],[296,6,296,7],[290,2,290,3],[290,6,290,7],[292,1,292,3],[292,5,292,7],[293,2,293,3],[293,6,293,7],[286,2,286,3],[286,6,286,7],[287,2,287,3],[287,6,287,7],[288,1,289,1],[288,5,289,5],[289,2,289,3],[289,6,289,7],[283,2,283,3],[283,6,283,7],[284,2,284,3],[284,6,284,7],[285,2,285,3],[285,6,285,7],[279,2,279,3],[279,6,279,7],[281,1,281,3],[281,5,281,7],[282,2,282,3],[282,6,282,7],[275,2,275,3],[275,6,275,7],[276,2,276,3],[276,6,276,7],[277,1,278,1],[277,5,278,5],[278,2,278,3],[278,6,278,7],[272,2,272,3],[272,6,272,7],[273,2,273,3],[273,6,273,7],[274,2,274,3],[274,6,274,7],[268,2,268,3],[268,6,268,7],[270,1,270,3],[270,5,270,7],[271,2,271,3],[271,6,271,7],[264,2,264,3],[264,6,264,7],[265,2,265,3],[265,6,265,7],[266,1,267,1],[266,5,267,5],[267,2,267,3],[267,6,267,7],[261,2,261,3],[261,6,261,7],[262,2,262,3],[262,6,262,7],[263,2,263,3],[263,6,263,7],[257,2,257,3],[257,6,257,7],[259,1,259,3],[259,5,259,7],[260,2,260,3],[260,6,260,7],[253,2,253,3],[253,6,253,7],[254,2,254,3],[254,6,254,7],[255,1,256,1],[255,5,256,5],[256,2,256,3],[256,6,256,7],[250,2,250,3],[250,6,250,7],[251,2,251,3],[251,6,251,7],[252,2,252,3],[252,6,252,7],[246,2,246,3],[246,6,246,7],[248,1,248,3],[248,5,248,7],[249,2,249,3],[249,6,249,7],[242,2,242,3],[242,6,242,7],[243,2,243,3],[243,6,243,7],[244,1,245,1],[244,5,245,5],[245,2,245,3],[245,6,245,7],[239,2,239,3],[239,6,239,7],[240,2,240,3],[240,6,240,7],[241,2,241,3],[241,6,241,7],[235,2,235,3],[235,6,235,7],[237,1,237,3],[237,5,237,7],[238,2,238,3],[238,6,238,7],[231,2,231,3],[231,6,231,7],[232,2,232,3],[232,6,232,7],[233,1,234,1],[233,5,234,5],[234,2,234,3],[234,6,234,7],[228,2,228,3],[228,6,228,7],[229,2,229,3],[229,6,229,7],[230,2,230,3],[230,6,230,7],[224,2,224,3],[224,6,224,7],[226,1,226,3],[226,5,226,7]],"merged_total":1604,"flags":["merged_cut"]}
[]
[null,"赤い部分がある場合は出品一覧表に戻ってご入力ください。"]
[null,"A4用紙を縦にセットして最終ページまでを印刷してください。"]
[null,"児童生徒学生の名前と必ず一致するようご注意ください。"]
[null,"第二水準以外の漢字は名前の後ろに赤で手書きしてください。"]
[]
[null,"のりしろ",null,null,null,"のりしろ"]
[null,"Ｎｏ",1,null,null,"Ｎｏ",2]
[null,"ふりがな",{"$f":"出品一覧表!$D$10","v":0},null,null,"ふりがな",{"$f":"出品一覧表!$D$10","v":0}]
[null,"所属学校名",{"$f":"出品一覧表!$D$11","v":0},null,null,"所属学校名",{"$f":"出品一覧表!$D$11","v":0}]
[null,"学年",{"$f":"VLOOKUP(C8,出品一覧表!$B$23:$I$152,5)","v":"  "},null,null,"学年",{"$f":"VLOOKUP(G8,出品一覧表!$B$23:$I$152,5)","v":"  "}]
[null,"ふりがな",{"$f":"VLOOKUP(C8,出品一覧表!$B$23:$I$152,7)","v":0},null,null,"ふりがな",{"$f":"VLOOKUP(G8,出品一覧表!$B$23:$I$152,7)","v":0}]
[null,"本人名前",{"$f":"VLOOKUP(C8,出品一覧表!$B$23:$I$152,6)","v":""},null,null,"本人名前",{"$f":"VLOOKUP(G8,出品一覧表!$B$23:$I$152,6)","v":""}]
[null,"連絡先住所","〒",{"$f":"出品一覧表!$D$14","v":0},null,"連絡先住所","〒",{"$f":"出品一覧表!$D$14","v":0}]
[null,null,{"$f":"出品一覧表!$D$15","v":0},null,null,null,{"$f":"出品一覧表!$D$15","v":0}]
[null,"電話番号",{"$f":"出品一覧表!$D$16","v":0},null,null,"電話番号",{"$f":"出品一覧表!$D$16","v":0}]
[]
[null,"のりしろ",null,null,null,"のりしろ"]
[null,"Ｎｏ",3,null,null,"Ｎｏ",4]
[null,"ふりがな",{"$f":"出品一覧表!$D$10","v":0},null,null,"ふりがな",{"$f":"出品一覧表!$D$10","v":0}]
[null,"所属学校名",{"$f":"出品一覧表!$D$11","v":0},null,null,"所属学校名",{"$f":"出品一覧表!$D$11","v":0}]
[null,"学年",{"$f":"VLOOKUP(C19,出品一覧表!$B$23:$I$152,5)","v":"  "},null,null,"学年",{"$f":"VLOOKUP(G19,出品一覧表!$B$23:$I$152,5)","v":"  "}]
[null,"ふりがな",{"$f":"VLOOKUP(C19,出品一覧表!$B$23:$I$152,7)","v":0},null,null,"ふりがな",{"$f":"VLOOKUP(G19,出品一覧表!$B$23:$I$152,7)","v":0}]
[null,"本人名前",{"$f":"VLOOKUP(C19,出品一覧表!$B$23:$I$152,6)","v":""},null,null,"本人名前",{"$f":"VLOOKUP(G19,出品一覧表!$B$23:$I$152,6)","v":""}]
[null,"連絡先住所","〒",{"$f":"出品一覧表!$D$14","v":0},null,"連絡先住所","〒",{"$f":"出品一覧表!$D$14","v":0}]
[null,null,{"$f":"出品一覧表!$D$15","v":0},null,null,null,{"$f":"出品一覧表!$D$15","v":0}]
[null,"電話番号",{"$f":"出品一覧表!$D$16","v":0},null,null,"電話番号",{"$f":"出品一覧表!$D$16","v":0}]
[]
[null,"のりしろ",null,null,null,"のりしろ"]
[null,"Ｎｏ",5,null,null,"Ｎｏ",6]
[null,"ふりがな",{"$f":"出品一覧表!$D$10","v":0},null,null,"ふりがな",{"$f":"出品一覧表!$D$10","v":0}]
[null,"所属学校名",{"$f":"出品一覧表!$D$11","v":0},null,null,"所属学校名",{"$f":"出品一覧表!$D$11","v":0}]
[null,"学年",{"$f":"VLOOKUP(C30,出品一覧表!$B$23:$I$152,5)","v":"  "},null,null,"学年",{"$f":"VLOOKUP(G30,出品一覧表!$B$23:$I$152,5)","v":"  "}]
[null,"ふりがな",{"$f":"VLOOKUP(C30,出品一覧表!$B$23:$I$152,7)","v":0},null,null,"ふりがな",{"$f":"VLOOKUP(G30,出品一覧表!$B$23:$I$152,7)","v":0}]
[null,"本人名前",{"$f":"VLOOKUP(C30,出品一覧表!$B$23:$I$152,6)","v":""},null,null,"本人名前",{"$f":"VLOOKUP(G30,出品一覧表!$B$23:$I$152,6)","v":""}]
[null,"連絡先住所","〒",{"$f":"出品一覧表!$D$14","v":0},null,"連絡先住所","〒",{"$f":"出品一覧表!$D$14","v":0}]
[null,null,{"$f":"出品一覧表!$D$15","v":0},null,null,null,{"$f":"出品一覧表!$D$15","v":0}]
[null,"電話番号",{"$f":"出品一覧表!$D$16","v":0},null,null,"電話番号",{"$f":"出品一覧表!$D$16","v":0}]
[]
[null,"のりしろ",null,null,null,"のりしろ"]
[null,"Ｎｏ",7,null,null,"Ｎｏ",8]
[null,"ふりがな",{"$f":"出品一覧表!$D$10","v":0},null,null,"ふりがな",{"$f":"出品一覧表!$D$10","v":0}]
[null,"所属学校名",{"$f":"出品一覧表!$D$11","v":0},null,null,"所属学校名",{"$f":"出品一覧表!$D$11","v":0}]
[null,"学年",{"$f":"VLOOKUP(C41,出品一覧表!$B$23:$I$152,5)","v":"  "},null,null,"学年",{"$f":"VLOOKUP(G41,出品一覧表!$B$23:$I$152,5)","v":"  "}]
[null,"ふりがな",{"$f":"VLOOKUP(C41,出品一覧表!$B$23:$I$152,7)","v":0},null,null,"ふりがな",{"$f":"VLOOKUP(G41,出品一覧表!$B$23:$I$152,7)","v":0}]
[null,"本人名前",{"$f":"VLOOKUP(C41,出品一覧表!$B$23:$I$152,6)","v":""},null,null,"本人名前",{"$f":"VLOOKUP(G41,出品一覧表!$B$23:$I$152,6)","v":""}]
[null,"連絡先住所","〒",{"$f":"出品一覧表!$D$14","v":0},null,"連絡先住所","〒",{"$f":"出品一覧表!$D$14","v":0}]
[null,null,{"$f":"出品一覧表!$D$15","v":0},null,null,null,{"$f":"出品一覧表!$D$15","v":0}]
[null,"電話番号",{"$f":"出品一覧表!$D$16","v":0},null,null,"電話番号",{"$f":"出品一覧表!$D$16","v":0}]
[]
[null,"のりしろ",null,null,null,"のりしろ"]
[null,"Ｎｏ",9,null,null,"Ｎｏ",10]
[null,"ふりがな",{"$f":"出品一覧表!$D$10","v":0},null,null,"ふりがな",{"$f":"出品一覧表!$D$10","v":0}]
[null,"所属学校名",{"$f":"出品一覧表!$D$11","v":0},null,null,"所属学校名",{"$f":"出品一覧表!$D$11","v":0}]
[null,"学年",{"$f":"VLOOKUP(C52,出品一覧表!$B$23:$I$152,5)","v":"  "},null,null,"学年",{"$f":"VLOOKUP(G52,出品一覧表!$B$23:$I$152,5)","v":"  "}]
[null,"ふりがな",{"$f":"VLOOKUP(C52,出品一覧表!$B$23:$I$152,7)","v":0},null,null,"ふりがな",{"$f":"VLOOKUP(G52,出品一覧表!$B$23:$I$152,7)","v":0}]
[null,"本人名前",{"$f":"VLOOKUP(C52,出品一覧表!$B$23:$I$152,6)","v":""},null,null,"本人名前",{"$f":"VLOOKUP(G52,出品一覧表!$B$23:$I$152,6)","v":""}]
[null,"連絡先住所","〒",{"$f":"出品一覧表!$D$14","v":0},null,"連絡先住所","〒",{"$f":"出品一覧表!$D$14","v":0}]
[null,null,{"$f":"出品一覧表!$D$15","v":0},null,null,null,{"$f":"出品一覧表!$D$15","v":0}]
[null,"電話番号",{"$f":"出品一覧表!$D$16","v":0},null,null,"電話番号",{"$f":"出品一覧表!$D$16","v":0}]
{"$rows_left_out":825}